Reaction Details
TargetMu-type opioid receptor
LigandBDBM50159682
Substrate/Competitorn/a
Meas. Tech.ChEMBL_302850 (CHEMBL828766)
Ki 0.132±n/a nM
Citation Li, TFujita, YTsuda, YMiyazaki, AAmbo, ASasaki, YJinsmaa, YBryant, SDLazarus, LHOkada, Y Development of potent mu-opioid receptor ligands using unique tyrosine analogues of endomorphin-2. J Med Chem48:586-92 (2005) 
 
Mu-type opioid receptor
Name:Mu-type opioid receptor
Type:G Protein-Coupled Receptor (GPCR)
Mol. Mass.:44503.11
Organism:Rattus norvegicus (rat)
Description:Competition binding assays were carried out using membrane preparations from transfected HN9.10 cells that constitutively expressed the mu opioid receptor.
Residue:398
BDBM50159682
NameBDBM50159682
Synonyms:(S)-1-[2-Amino-3-(4-hydroxy-2-methyl-phenyl)-propionyl]-pyrrolidine-2-carboxylic acid [(S)-1-((S)-1-carbamoyl-2-phenyl-ethylcarbamoyl)-2-phenyl-ethyl]-amide | CHEMBL367068
TypeSmall organic molecule
Emp. Form.C33H39N5O5
Mol. Mass.585.6933
SMILESCc1cc(O)ccc1CC(N)C(=O)N1CCC[C@H]1C(=O)N[C@@H](Cc1ccccc1)C(=O)N[C@@H](Cc1ccccc1)C(N)=O