Reaction Details
TargetCarbonic anhydrase 4
LigandBDBM92494
Substrate/Competitorn/a
Meas. Tech.ChEMBL_302623 (CHEMBL838820)
Ki 99.0±n/a nM
Citation Innocenti, AVullo, DScozzafava, ACasey, JRSupuran, C Carbonic anhydrase inhibitors. Interaction of isozymes I, II, IV, V, and IX with carboxylates. Bioorg Med Chem Lett15:573-8 (2005) 
 
Carbonic anhydrase 4
Name:Carbonic anhydrase 4
Type:Enzyme
Mol. Mass.:35037.98
Organism:Homo sapiens (Human)
Description:P22748
Residue:312
BDBM92494
NameBDBM92494
Synonyms:Citrate | SODIUM CITRATE
TypeSmall organic molecule
Emp. Form.C6H5O7
Mol. Mass.189.1013
SMILESOC(CC([O-])=O)(CC([O-])=O)C([O-])=O