Reaction Details
TargetMu-type opioid receptor
LigandBDBM50159899
Substrate/Competitorn/a
Meas. Tech.ChEMBL_303727 (CHEMBL829062)
Ki 103±n/a nM
Citation Palin, RBarn, DRClark, JKCottney, JECowley, PMCrockatt, MEvans, LFeilden, HGoodwin, RRGriekspoor, FGrove, SJHoughton, AKJones, PSMorphy, RJSmith, ARSundaram, HVrolijk, DWeston, MAWishart, GWren, P Synthesis and SAR studies of 3-phenoxypropyl piperidine analogues as ORL1 (NOP) receptor agonists. Bioorg Med Chem Lett15:589-93 (2005) 
 
Mu-type opioid receptor
Name:Mu-type opioid receptor
Type:G Protein-Coupled Receptor (GPCR)
Mol. Mass.:44789.51
Organism:Homo sapiens (Human)
Description:P35372
Residue:400
BDBM50159899
NameBDBM50159899
Synonyms:1-{1-[3-(2-Chloro-5-methyl-phenoxy)-3-cyclohexyl-2-hydroxy-propyl]-piperidin-4-yl}-1,3-dihydro-benzoimidazol-2-one | CHEMBL264288
TypeSmall organic molecule
Emp. Form.C28H36ClN3O3
Mol. Mass.498.057
SMILESCc1ccc(Cl)c(OC(C(O)CN2CCC(CC2)n2c3ccccc3[nH]c2=O)C2CCCCC2)c1