Reaction Details
TargetNociceptin receptor
LigandBDBM50159907
Substrate/Competitorn/a
Meas. Tech.ChEMBL_303722 (CHEMBL829057)
Ki 52±n/a nM
Citation Palin, RBarn, DRClark, JKCottney, JECowley, PMCrockatt, MEvans, LFeilden, HGoodwin, RRGriekspoor, FGrove, SJHoughton, AKJones, PSMorphy, RJSmith, ARSundaram, HVrolijk, DWeston, MAWishart, GWren, P Synthesis and SAR studies of 3-phenoxypropyl piperidine analogues as ORL1 (NOP) receptor agonists. Bioorg Med Chem Lett15:589-93 (2005) 
 
Nociceptin receptor
Name:Nociceptin receptor
Type:G Protein-Coupled Receptor (GPCR)
Mol. Mass.:40702.87
Organism:Homo sapiens (Human)
Description:P41146
Residue:370
BDBM50159907
NameBDBM50159907
Synonyms:1-{1-[3-(4-Fluoro-3-methyl-phenoxy)-4-methyl-pentyl]-piperidin-4-yl}-1,3-dihydro-benzoimidazol-2-one | CHEMBL179797
TypeSmall organic molecule
Emp. Form.C25H32FN3O2
Mol. Mass.425.5389
SMILESCC(C)C(CCN1CCC(CC1)n1c2ccccc2[nH]c1=O)Oc1ccc(F)c(C)c1