Reaction Details
TargetNociceptin receptor
LigandBDBM50159904
Substrate/Competitorn/a
Meas. Tech.ChEMBL_303722 (CHEMBL829057)
Ki 12±n/a nM
Citation Palin, RBarn, DRClark, JKCottney, JECowley, PMCrockatt, MEvans, LFeilden, HGoodwin, RRGriekspoor, FGrove, SJHoughton, AKJones, PSMorphy, RJSmith, ARSundaram, HVrolijk, DWeston, MAWishart, GWren, P Synthesis and SAR studies of 3-phenoxypropyl piperidine analogues as ORL1 (NOP) receptor agonists. Bioorg Med Chem Lett15:589-93 (2005) 
 
Nociceptin receptor
Name:Nociceptin receptor
Type:G Protein-Coupled Receptor (GPCR)
Mol. Mass.:40702.87
Organism:Homo sapiens (Human)
Description:P41146
Residue:370
BDBM50159904
NameBDBM50159904
Synonyms:1-(1-{2-[1-(2-Chloro-5-methyl-phenoxy)-cyclohexyl]-2-hydroxy-ethyl}-piperidin-4-yl)-1,3-dihydro-benzoimidazol-2-one | CHEMBL424971
TypeSmall organic molecule
Emp. Form.C27H34ClN3O3
Mol. Mass.484.03
SMILESCc1ccc(Cl)c(OC2(CCCCC2)C(O)CN2CCC(CC2)n2c3ccccc3[nH]c2=O)c1