Reaction Details
TargetMu-type opioid receptor
LigandBDBM50200597
Substrate/Competitorn/a
Meas. Tech.ChEMBL_303727 (CHEMBL829062)
Ki 59±n/a nM
Citation Palin, RBarn, DRClark, JKCottney, JECowley, PMCrockatt, MEvans, LFeilden, HGoodwin, RRGriekspoor, FGrove, SJHoughton, AKJones, PSMorphy, RJSmith, ARSundaram, HVrolijk, DWeston, MAWishart, GWren, P Synthesis and SAR studies of 3-phenoxypropyl piperidine analogues as ORL1 (NOP) receptor agonists. Bioorg Med Chem Lett15:589-93 (2005) 
 
Mu-type opioid receptor
Name:Mu-type opioid receptor
Type:G Protein-Coupled Receptor (GPCR)
Mol. Mass.:44789.51
Organism:Homo sapiens (Human)
Description:P35372
Residue:400
BDBM50200597
NameBDBM50200597
Synonyms:1-(1-(3-(5-methoxy-2-methylphenoxy)-4-methylpentyl)piperidin-4-yl)-1H-benzo[d]imidazol-2(3H)-one CHEMBL427683
TypeSmall organic molecule
Emp. Form.C26H35N3O3
Mol. Mass.437.5744
SMILESCOc1ccc(C)c(OC(CCN2CCC(CC2)n2c3ccccc3[nH]c2=O)C(C)C)c1