Reaction Details
TargetNociceptin receptor
LigandBDBM50159918
Substrate/Competitorn/a
Meas. Tech.ChEMBL_303722 (CHEMBL829057)
Ki 38.2±n/a nM
Citation Palin, RBarn, DRClark, JKCottney, JECowley, PMCrockatt, MEvans, LFeilden, HGoodwin, RRGriekspoor, FGrove, SJHoughton, AKJones, PSMorphy, RJSmith, ARSundaram, HVrolijk, DWeston, MAWishart, GWren, P Synthesis and SAR studies of 3-phenoxypropyl piperidine analogues as ORL1 (NOP) receptor agonists. Bioorg Med Chem Lett15:589-93 (2005) 
 
Nociceptin receptor
Name:Nociceptin receptor
Type:G Protein-Coupled Receptor (GPCR)
Mol. Mass.:40702.87
Organism:Homo sapiens (Human)
Description:P41146
Residue:370
BDBM50159918
NameBDBM50159918
Synonyms:1-{1-[3-(2-Chloro-5-methyl-phenoxy)-2-hydroxy-3-phenyl-propyl]-piperidin-4-yl}-1,3-dihydro-benzoimidazol-2-one | CHEMBL182328
TypeSmall organic molecule
Emp. Form.C28H30ClN3O3
Mol. Mass.492.009
SMILESCc1ccc(Cl)c(OC(C(O)CN2CCC(CC2)n2c3ccccc3[nH]c2=O)c2ccccc2)c1