Reaction Details
TargetMu-type opioid receptor
LigandBDBM50159927
Substrate/Competitorn/a
Meas. Tech.ChEMBL_303727 (CHEMBL829062)
Ki 102±n/a nM
Citation Palin, RBarn, DRClark, JKCottney, JECowley, PMCrockatt, MEvans, LFeilden, HGoodwin, RRGriekspoor, FGrove, SJHoughton, AKJones, PSMorphy, RJSmith, ARSundaram, HVrolijk, DWeston, MAWishart, GWren, P Synthesis and SAR studies of 3-phenoxypropyl piperidine analogues as ORL1 (NOP) receptor agonists. Bioorg Med Chem Lett15:589-93 (2005) 
 
Mu-type opioid receptor
Name:Mu-type opioid receptor
Type:G Protein-Coupled Receptor (GPCR)
Mol. Mass.:44789.51
Organism:Homo sapiens (Human)
Description:P35372
Residue:400
BDBM50159927
NameBDBM50159927
Synonyms:1-(1-{2-[1-(2-Chloro-5-methyl-phenoxy)-cyclohexyl]-2-dimethylamino-ethyl}-piperidin-4-yl)-1,3-dihydro-benzoimidazol-2-one | CHEMBL183918
TypeSmall organic molecule
Emp. Form.C29H39ClN4O2
Mol. Mass.511.099
SMILESCN(C)C(CN1CCC(CC1)n1c2ccccc2[nH]c1=O)C1(CCCCC1)Oc1cc(C)ccc1Cl