Reaction Details
TargetMu-type opioid receptor
LigandBDBM50159923
Substrate/Competitorn/a
Meas. Tech.ChEMBL_303727 (CHEMBL829062)
Ki 38±n/a nM
Citation Palin, RBarn, DRClark, JKCottney, JECowley, PMCrockatt, MEvans, LFeilden, HGoodwin, RRGriekspoor, FGrove, SJHoughton, AKJones, PSMorphy, RJSmith, ARSundaram, HVrolijk, DWeston, MAWishart, GWren, P Synthesis and SAR studies of 3-phenoxypropyl piperidine analogues as ORL1 (NOP) receptor agonists. Bioorg Med Chem Lett15:589-93 (2005) 
 
Mu-type opioid receptor
Name:Mu-type opioid receptor
Type:G Protein-Coupled Receptor (GPCR)
Mol. Mass.:44789.51
Organism:Homo sapiens (Human)
Description:P35372
Residue:400
BDBM50159923
NameBDBM50159923
Synonyms:1-{1-[3-(4-Fluoro-2-methyl-phenoxy)-4-methyl-pentyl]-piperidin-4-yl}-1,3-dihydro-benzoimidazol-2-one | CHEMBL367367
TypeSmall organic molecule
Emp. Form.C25H32FN3O2
Mol. Mass.425.5389
SMILESCC(C)C(CCN1CCC(CC1)n1c2ccccc2[nH]c1=O)Oc1ccc(F)cc1C