Reaction Details
TargetNociceptin receptor
LigandBDBM50200597
Substrate/Competitorn/a
Meas. Tech.ChEMBL_303722 (CHEMBL829057)
Ki 4±n/a nM
Citation Palin, RBarn, DRClark, JKCottney, JECowley, PMCrockatt, MEvans, LFeilden, HGoodwin, RRGriekspoor, FGrove, SJHoughton, AKJones, PSMorphy, RJSmith, ARSundaram, HVrolijk, DWeston, MAWishart, GWren, P Synthesis and SAR studies of 3-phenoxypropyl piperidine analogues as ORL1 (NOP) receptor agonists. Bioorg Med Chem Lett15:589-93 (2005) 
 
Nociceptin receptor
Name:Nociceptin receptor
Type:G Protein-Coupled Receptor (GPCR)
Mol. Mass.:40702.87
Organism:Homo sapiens (Human)
Description:P41146
Residue:370
BDBM50200597
NameBDBM50200597
Synonyms:1-(1-(3-(5-methoxy-2-methylphenoxy)-4-methylpentyl)piperidin-4-yl)-1H-benzo[d]imidazol-2(3H)-one CHEMBL427683
TypeSmall organic molecule
Emp. Form.C26H35N3O3
Mol. Mass.437.5744
SMILESCOc1ccc(C)c(OC(CCN2CCC(CC2)n2c3ccccc3[nH]c2=O)C(C)C)c1