Reaction Details
TargetCannabinoid receptor 2
LigandBDBM50160095
Substrate/Competitorn/a
Meas. Tech.ChEMBL_305570 (CHEMBL827164)
IC50 815±n/a nM
Citation Meurer, LCFinke, PEMills, SGWalsh, TFToupence, RBDebenham, JSGoulet, MTWang, JTong, XFong, TMLao, JSchaeffer, MTChen, JShen, CPSloan Stribling, DShearman, LPStrack, AMVan der Ploeg, LH Synthesis and SAR of 5,6-diarylpyridines as human CB1 inverse agonists. Bioorg Med Chem Lett15:645-51 (2005) 
 
Cannabinoid receptor 2
Name:Cannabinoid receptor 2
Type:G Protein-Coupled Receptor (GPCR)
Mol. Mass.:39690.94
Organism:Homo sapiens (Human)
Description:P34972
Residue:360
BDBM50160095
NameBDBM50160095
Synonyms:5-(4-Chloro-phenyl)-6-(2,4-dichloro-phenyl)-2-(3,4-difluoro-benzyloxy)-N-propyl-nicotinamide | CHEMBL425163
TypeSmall organic molecule
Emp. Form.C28H21Cl3F2N2O2
Mol. Mass.561.834
SMILESCCCNC(=O)c1cc(-c2ccc(Cl)cc2)c(nc1OCc1ccc(F)c(F)c1)-c1ccc(Cl)cc1Cl