Reaction Details
TargetCannabinoid receptor 2
LigandBDBM50160097
Substrate/Competitorn/a
Meas. Tech.ChEMBL_305570 (CHEMBL827164)
IC50 820±n/a nM
Citation Meurer, LCFinke, PEMills, SGWalsh, TFToupence, RBDebenham, JSGoulet, MTWang, JTong, XFong, TMLao, JSchaeffer, MTChen, JShen, CPSloan Stribling, DShearman, LPStrack, AMVan der Ploeg, LH Synthesis and SAR of 5,6-diarylpyridines as human CB1 inverse agonists. Bioorg Med Chem Lett15:645-51 (2005) 
 
Cannabinoid receptor 2
Name:Cannabinoid receptor 2
Type:G Protein-Coupled Receptor (GPCR)
Mol. Mass.:39690.94
Organism:Homo sapiens (Human)
Description:P34972
Residue:360
BDBM50160097
NameBDBM50160097
Synonyms:5-(4-Chloro-phenyl)-6-(2,4-dichloro-phenyl)-2-(3,4-difluoro-benzyloxy)-N-ethyl-nicotinamide | CHEMBL360104
TypeSmall organic molecule
Emp. Form.C27H19Cl3F2N2O2
Mol. Mass.547.808
SMILESCCNC(=O)c1cc(-c2ccc(Cl)cc2)c(nc1OCc1ccc(F)c(F)c1)-c1ccc(Cl)cc1Cl