Reaction Details
TargetCannabinoid receptor 2
LigandBDBM50160100
Substrate/Competitorn/a
Meas. Tech.ChEMBL_305570 (CHEMBL827164)
IC50 520±n/a nM
Citation Meurer, LCFinke, PEMills, SGWalsh, TFToupence, RBDebenham, JSGoulet, MTWang, JTong, XFong, TMLao, JSchaeffer, MTChen, JShen, CPSloan Stribling, DShearman, LPStrack, AMVan der Ploeg, LH Synthesis and SAR of 5,6-diarylpyridines as human CB1 inverse agonists. Bioorg Med Chem Lett15:645-51 (2005) 
 
Cannabinoid receptor 2
Name:Cannabinoid receptor 2
Type:G Protein-Coupled Receptor (GPCR)
Mol. Mass.:39690.94
Organism:Homo sapiens (Human)
Description:P34972
Residue:360
BDBM50160100
NameBDBM50160100
Synonyms:2-(3,4-difluorobenzyloxy)-5-(4-chlorophenyl)-6-(2,4-dichlorophenyl)nicotinonitrile CHEMBL367819
TypeSmall organic molecule
Emp. Form.C25H13Cl3F2N2O
Mol. Mass.501.739
SMILESFc1ccc(COc2nc(-c3ccc(Cl)cc3Cl)c(cc2C#N)-c2ccc(Cl)cc2)cc1F