Reaction Details
TargetCannabinoid receptor 1
LigandBDBM50160106
Substrate/Competitorn/a
Meas. Tech.ChEMBL_305569 (CHEMBL827163)
IC50 32±n/a nM
Citation Meurer, LCFinke, PEMills, SGWalsh, TFToupence, RBDebenham, JSGoulet, MTWang, JTong, XFong, TMLao, JSchaeffer, MTChen, JShen, CPSloan Stribling, DShearman, LPStrack, AMVan der Ploeg, LH Synthesis and SAR of 5,6-diarylpyridines as human CB1 inverse agonists. Bioorg Med Chem Lett15:645-51 (2005) 
 
Cannabinoid receptor 1
Name:Cannabinoid receptor 1
Type:G Protein-Coupled Receptor (GPCR)
Mol. Mass.:52868.96
Organism:Homo sapiens (Human)
Description:P21554
Residue:472
BDBM50160106
NameBDBM50160106
Synonyms:5-(4-Chloro-phenyl)-6-(2,4-dichloro-phenyl)-pyridine-2-carboxylic acid (1-propyl-butyl)-amide | CHEMBL180447
TypeSmall organic molecule
Emp. Form.C25H25Cl3N2O
Mol. Mass.475.838
SMILESCCCC(CCC)NC(=O)c1ccc(-c2ccc(Cl)cc2)c(n1)-c1ccc(Cl)cc1Cl