Reaction Details
TargetCannabinoid receptor 1
LigandBDBM50160116
Substrate/Competitorn/a
Meas. Tech.ChEMBL_305569 (CHEMBL827163)
IC50 31±n/a nM
Citation Meurer, LCFinke, PEMills, SGWalsh, TFToupence, RBDebenham, JSGoulet, MTWang, JTong, XFong, TMLao, JSchaeffer, MTChen, JShen, CPSloan Stribling, DShearman, LPStrack, AMVan der Ploeg, LH Synthesis and SAR of 5,6-diarylpyridines as human CB1 inverse agonists. Bioorg Med Chem Lett15:645-51 (2005) 
 
Cannabinoid receptor 1
Name:Cannabinoid receptor 1
Type:G Protein-Coupled Receptor (GPCR)
Mol. Mass.:52868.96
Organism:Homo sapiens (Human)
Description:P21554
Residue:472
BDBM50160116
NameBDBM50160116
Synonyms:5-(4-Chloro-phenyl)-6-(2,4-dichloro-phenyl)-pyridine-2-carboxylic acid benzylamide | CHEMBL182141
TypeSmall organic molecule
Emp. Form.C25H17Cl3N2O
Mol. Mass.467.774
SMILESClc1ccc(cc1)-c1ccc(nc1-c1ccc(Cl)cc1Cl)C(=O)NCc1ccccc1