Reaction Details
TargetCannabinoid receptor 1
LigandBDBM50160135
Substrate/Competitorn/a
Meas. Tech.ChEMBL_305569 (CHEMBL827163)
IC50 41±n/a nM
Citation Meurer, LCFinke, PEMills, SGWalsh, TFToupence, RBDebenham, JSGoulet, MTWang, JTong, XFong, TMLao, JSchaeffer, MTChen, JShen, CPSloan Stribling, DShearman, LPStrack, AMVan der Ploeg, LH Synthesis and SAR of 5,6-diarylpyridines as human CB1 inverse agonists. Bioorg Med Chem Lett15:645-51 (2005) 
 
Cannabinoid receptor 1
Name:Cannabinoid receptor 1
Type:G Protein-Coupled Receptor (GPCR)
Mol. Mass.:52868.96
Organism:Homo sapiens (Human)
Description:P21554
Residue:472
BDBM50160135
NameBDBM50160135
Synonyms:2-Benzyloxy-5-(4-chloro-phenyl)-6-(2,4-dichloro-phenyl)-N-piperidin-1-yl-nicotinamide | CHEMBL180028
TypeSmall organic molecule
Emp. Form.C30H26Cl3N3O2
Mol. Mass.566.905
SMILESClc1ccc(cc1)-c1cc(C(=O)NN2CCCCC2)c(OCc2ccccc2)nc1-c1ccc(Cl)cc1Cl