Reaction Details
TargetCannabinoid receptor 1
LigandBDBM50160137
Substrate/Competitorn/a
Meas. Tech.ChEMBL_305569 (CHEMBL827163)
IC50 1.4±n/a nM
Citation Meurer, LCFinke, PEMills, SGWalsh, TFToupence, RBDebenham, JSGoulet, MTWang, JTong, XFong, TMLao, JSchaeffer, MTChen, JShen, CPSloan Stribling, DShearman, LPStrack, AMVan der Ploeg, LH Synthesis and SAR of 5,6-diarylpyridines as human CB1 inverse agonists. Bioorg Med Chem Lett15:645-51 (2005) 
 
Cannabinoid receptor 1
Name:Cannabinoid receptor 1
Type:G Protein-Coupled Receptor (GPCR)
Mol. Mass.:52868.96
Organism:Homo sapiens (Human)
Description:P21554
Residue:472
BDBM50160137
NameBDBM50160137
Synonyms:2-Benzyloxy-5-(4-chloro-phenyl)-6-(2,4-dichloro-phenyl)-N-ethyl-nicotinamide | CHEMBL360763
TypeSmall organic molecule
Emp. Form.C27H21Cl3N2O2
Mol. Mass.511.827
SMILESCCNC(=O)c1cc(-c2ccc(Cl)cc2)c(nc1OCc1ccccc1)-c1ccc(Cl)cc1Cl