Reaction Details
TargetAlpha-1A adrenergic receptor
LigandBDBM50160148
Substrate/Competitorn/a
Meas. Tech.ChEMBL_303296 (CHEMBL827429)
Ki 0.36±n/a nM
Citation Li, MYTsai, KCXia, L Pharmacophore identification of alpha(1A)-adrenoceptor antagonists. Bioorg Med Chem Lett15:657-64 (2005) 
 
Alpha-1A adrenergic receptor
Name:Alpha-1A adrenergic receptor
Type:Cell-surface receptors
Mol. Mass.:51511.67
Organism:Homo sapiens (Human)
Description:P35348
Residue:466
BDBM50160148
NameBDBM50160148
Synonyms:(S)-4-(3,4-Difluoro-phenyl)-6-methoxymethyl-2-oxo-3-[3-(3'',4'',5'',6''-tetrahydro-2''H-[2,4'']bipyridinyl-1''-yl)-propylcarbamoyl]-1,2,3,4-tetrahydro-pyrimidine-5-carboxylic acid methyl ester L-771688
TypeSmall organic molecule
Emp. Form.C28H33F2N5O5
Mol. Mass.557.5889
SMILESCOCC1=C([C@@H](N(C(=O)NCCCN2CCC(CC2)c2ccccn2)C(=O)N1)c1ccc(F)c(F)c1)C(=O)OC