Reaction Details
TargetAlpha-1A adrenergic receptor
LigandBDBM50160149
Substrate/Competitorn/a
Meas. Tech.ChEMBL_303296 (CHEMBL827429)
Ki 0.18±n/a nM
Citation Li, MYTsai, KCXia, L Pharmacophore identification of alpha(1A)-adrenoceptor antagonists. Bioorg Med Chem Lett15:657-64 (2005) 
 
Alpha-1A adrenergic receptor
Name:Alpha-1A adrenergic receptor
Type:Cell-surface receptors
Mol. Mass.:51511.67
Organism:Homo sapiens (Human)
Description:P35348
Residue:466
BDBM50160149
NameBDBM50160149
Synonyms:(R)-5-[3-(4,4-Diphenyl-piperidin-1-yl)-propylcarbamoyl]-2,6-dimethyl-4-(4-nitro-phenyl)-1,4-dihydro-pyridine-3-carboxylic acid methyl ester | CHEMBL179334
TypeSmall organic molecule
Emp. Form.C36H40N4O5
Mol. Mass.608.7266
SMILESCOC(=O)C1[C@@H](C(C(=O)NCCCN2CCC(CC2)(c2ccccc2)c2ccccc2)=C(C)N=C1C)c1ccc(cc1)[N+]([O-])=O