Reaction Details
TargetCannabinoid receptor 1
LigandBDBM50160446
Substrate/Competitorn/a
Meas. Tech.ChEMBL_302577 (CHEMBL839538)
Ki 905±n/a nM
Citation Lavey, BJKozlowski, JAHipkin, RWGonsiorek, WLundell, DJPiwinski, JJNarula, SLunn, CA Triaryl bis-sulfones as a new class of cannabinoid CB2 receptor inhibitors: identification of a lead and initial SAR studies. Bioorg Med Chem Lett15:783-6 (2005) 
 
Cannabinoid receptor 1
Name:Cannabinoid receptor 1
Type:G Protein-Coupled Receptor (GPCR)
Mol. Mass.:52868.96
Organism:Homo sapiens (Human)
Description:P21554
Residue:472
BDBM50160446
NameBDBM50160446
Synonyms:CHEMBL180465 | N-((S)-1-{4-[4-Methoxy-2-(4-methoxy-benzenesulfonyl)-benzenesulfonyl]-phenyl}-ethyl)-methanesulfonamide
TypeSmall organic molecule
Emp. Form.C23H25NO8S3
Mol. Mass.539.642
SMILESCOc1ccc(cc1)S(=O)(=O)c1cc(OC)ccc1S(=O)(=O)c1ccc(cc1)[C@H](C)NS(C)(=O)=O