Reaction Details
TargetMetabotropic glutamate receptor 5
LigandBDBM50160623
Substrate/Competitorn/a
Meas. Tech.ChEMBL_303616 (CHEMBL828871)
Ki 155±n/a nM
Citation Alagille, DBaldwin, RMRoth, BLWroblewski, JTGrajkowska, ETamagnan, GD Functionalization at position 3 of the phenyl ring of the potent mGluR5 noncompetitive antagonists MPEP. Bioorg Med Chem Lett15:945-9 (2005) 
 
Metabotropic glutamate receptor 5
Name:Metabotropic glutamate receptor 5
Type:Enzyme
Mol. Mass.:131900.14
Organism:Rattus norvegicus (Rat)
Description:P31424
Residue:1203
BDBM50160623
NameBDBM50160623
Synonyms:2-methyl-6-[(5-thien-2-ylpyridin-3-yl)ethynyl]pyridine | CHEMBL360942
TypeSmall organic molecule
Emp. Form.C17H12N2S
Mol. Mass.276.356
SMILESCc1cccc(n1)C#Cc1cncc(c1)-c1cccs1