Reaction Details
TargetMetabotropic glutamate receptor 5
LigandBDBM50160621
Substrate/Competitorn/a
Meas. Tech.ChEMBL_303616 (CHEMBL828871)
Ki 993±n/a nM
Citation Alagille, DBaldwin, RMRoth, BLWroblewski, JTGrajkowska, ETamagnan, GD Functionalization at position 3 of the phenyl ring of the potent mGluR5 noncompetitive antagonists MPEP. Bioorg Med Chem Lett15:945-9 (2005) 
 
Metabotropic glutamate receptor 5
Name:Metabotropic glutamate receptor 5
Type:Enzyme
Mol. Mass.:131900.14
Organism:Rattus norvegicus (Rat)
Description:P31424
Residue:1203
BDBM50160621
NameBDBM50160621
Synonyms:2-Biphenyl-3-ylethynyl-6-methyl-pyridine | CHEMBL182866
TypeSmall organic molecule
Emp. Form.C20H15N
Mol. Mass.269.3398
SMILESCc1cccc(n1)C#Cc1cccc(c1)-c1ccccc1