Reaction Details
TargetMetabotropic glutamate receptor 5
LigandBDBM50160631
Substrate/Competitorn/a
Meas. Tech.ChEMBL_303616 (CHEMBL828871)
Ki 74±n/a nM
Citation Alagille, DBaldwin, RMRoth, BLWroblewski, JTGrajkowska, ETamagnan, GD Functionalization at position 3 of the phenyl ring of the potent mGluR5 noncompetitive antagonists MPEP. Bioorg Med Chem Lett15:945-9 (2005) 
 
Metabotropic glutamate receptor 5
Name:Metabotropic glutamate receptor 5
Type:Enzyme
Mol. Mass.:131900.14
Organism:Rattus norvegicus (Rat)
Description:P31424
Residue:1203
BDBM50160631
NameBDBM50160631
Synonyms:2-{[5-(3-methoxyphenyl)pyridin-3-yl]ethynyl}-6-methylpyridine | CHEMBL361615
TypeSmall organic molecule
Emp. Form.C20H16N2O
Mol. Mass.300.3538
SMILESCOc1cccc(c1)-c1cncc(c1)C#Cc1cccc(C)n1