Reaction Details
TargetD(2) dopamine receptor
LigandBDBM50160806
Substrate/Competitorn/a
Meas. Tech.ChEMBL_303342 (CHEMBL840158)
Ki 21.2±n/a nM
Citation Ochi, TSakamoto, MMinamida, ASuzuki, KUeda, TUne, TToda, HMatsumoto, KTerauchi, Y Syntheses and properties of the major hydroxy metabolites in humans of blonanserin AD-5423, a novel antipsychotic agent. Bioorg Med Chem Lett15:1055-9 (2005) 
 
D(2) dopamine receptor
Name:D(2) dopamine receptor
Type:Cell-surface receptors
Mol. Mass.:50647.10
Organism:Homo sapiens (Human)
Description:P14416
Residue:443
BDBM50160806
NameBDBM50160806
Synonyms:4-(4-Fluoro-phenyl)-2-(4-propyl-piperazin-1-yl)-5,6,7,8,9,10-hexahydro-cycloocta[b]pyridin-7-ol | CHEMBL362285
TypeSmall organic molecule
Emp. Form.C23H30FN3O
Mol. Mass.383.5022
SMILESCCN1CCN(CC1)c1cc(-c2ccc(F)cc2)c2CC[C@@H](O)CCCc2n1