Reaction Details
TargetBeta-2 adrenergic receptor
LigandBDBM50160817
Substrate/Competitorn/a
Meas. Tech.ChEMBL_310481 (CHEMBL834425)
EC50 1.5±n/a nM
Citation Sawa, MMizuno, KHarada, HTateishi, HArai, YSuzuki, SOue, MTsujiuchi, HFurutani, YKato, S Tryptamine-based human beta3-adrenergic receptor agonists. Part 3: improved oral bioavailability via modification of the sulfonamide moiety. Bioorg Med Chem Lett15:1061-4 (2005) 
 
Beta-2 adrenergic receptor
Name:Beta-2 adrenergic receptor
Type:n/a
Mol. Mass.:46461.69
Organism:Homo sapiens (Human)
Description:P07550
Residue:413
BDBM50160817
NameBDBM50160817
Synonyms:CHEMBL181964 | Methanesulfonic acid 3-((R)-2-{(R)-2-hydroxy-2-[3-(2-methyl-allylamino)-phenyl]-ethylamino}-propyl)-1H-indol-7-yl ester
TypeSmall organic molecule
Emp. Form.C24H31N3O4S
Mol. Mass.457.586
SMILESC[C@H](Cc1c[nH]c2c(OS(C)(=O)=O)cccc12)NC[C@H](O)c1cccc(NCC(C)=C)c1