Reaction Details
TargetKappa-type opioid receptor
LigandBDBM50160834
Substrate/Competitorn/a
Meas. Tech.ChEMBL_303046 (CHEMBL828016)
Ki 0.31±n/a nM
Citation Kumar, VGuo, DCassel, JADaubert, JDDehaven, RNDehaven-Hudkins, DLGauntner, EKGottshall, SLGreiner, SLKoblish, MLittle, PJMansson, EMaycock, AL Synthesis and evaluation of novel peripherally restricted kappa-opioid receptor agonists. Bioorg Med Chem Lett15:1091-5 (2005) 
 
Kappa-type opioid receptor
Name:Kappa-type opioid receptor
Type:G Protein-Coupled Receptor (GPCR)
Mol. Mass.:42648.76
Organism:Homo sapiens (Human)
Description:P41145
Residue:380
BDBM50160834
NameBDBM50160834
Synonyms:CHEMBL183248 | N-[(S)-1-(3-Amino-phenyl)-2-pyrrolidin-1-yl-ethyl]-N-methyl-2-(4-trifluoromethyl-phenyl)-acetamide
TypeSmall organic molecule
Emp. Form.C22H26F3N3O
Mol. Mass.405.4565
SMILESCN([C@H](CN1CCCC1)c1cccc(N)c1)C(=O)Cc1ccc(cc1)C(F)(F)F