Reaction Details
TargetKappa-type opioid receptor
LigandBDBM50160836
Substrate/Competitorn/a
Meas. Tech.ChEMBL_303046 (CHEMBL828016)
Ki 0.53±n/a nM
Citation Kumar, VGuo, DCassel, JADaubert, JDDehaven, RNDehaven-Hudkins, DLGauntner, EKGottshall, SLGreiner, SLKoblish, MLittle, PJMansson, EMaycock, AL Synthesis and evaluation of novel peripherally restricted kappa-opioid receptor agonists. Bioorg Med Chem Lett15:1091-5 (2005) 
 
Kappa-type opioid receptor
Name:Kappa-type opioid receptor
Type:G Protein-Coupled Receptor (GPCR)
Mol. Mass.:42648.76
Organism:Homo sapiens (Human)
Description:P41145
Residue:380
BDBM50160836
NameBDBM50160836
Synonyms:CHEMBL180803 | N-[1-(3-Methoxy-phenyl)-2-pyrrolidin-1-yl-ethyl]-N-methyl-2-(4-trifluoromethyl-phenyl)-acetamide
TypeSmall organic molecule
Emp. Form.C23H27F3N2O2
Mol. Mass.420.4679
SMILESCOc1cccc(c1)C(CN1CCCC1)N(C)C(=O)Cc1ccc(cc1)C(F)(F)F