Reaction Details
TargetCollagenase 3
LigandBDBM50160852
Substrate/Competitorn/a
Meas. Tech.ChEMBL_302900 (CHEMBL830361)
Ki 0.540000±n/a nM
Citation Kim, SHPudzianowski, ATLeavitt, KJBarbosa, JMcDonnell, PAMetzler, WJRankin, BMLiu, RVaccaro, WPitts, W Structure-based design of potent and selective inhibitors of collagenase-3 (MMP-13). Bioorg Med Chem Lett15:1101-6 (2005) 
 
Collagenase 3
Name:Collagenase 3
Type:Enzyme
Mol. Mass.:53808.06
Organism:Homo sapiens (Human)
Description:P45452
Residue:471
BDBM50160852
NameBDBM50160852
Synonyms:4-ethyl-1-(4-phenoxy-phenyl)-1,7,9-triaza-spiro[4.5]decane-2,6,8,10-tetraone | CHEMBL361527
TypeSmall organic molecule
Emp. Form.C21H19N3O5
Mol. Mass.393.3927
SMILESCCC1CC(=O)N(c2ccc(Oc3ccccc3)cc2)C11C(=O)NC(=O)NC1=O