Reaction Details
TargetRNA-directed RNA polymerase
LigandBDBM50160861
Substrate/Competitorn/a
Meas. Tech.ChEMBL_305682 (CHEMBL828054)
IC50 240±n/a nM
Citation Mashino, TShimotohno, KIkegami, NNishikawa, DOkuda, KTakahashi, KNakamura, SMochizuki, M Human immunodeficiency virus-reverse transcriptase inhibition and hepatitis C virus RNA-dependent RNA polymerase inhibition activities of fullerene derivatives. Bioorg Med Chem Lett15:1107-9 (2005) 
 
RNA-directed RNA polymerase
Name:RNA-directed RNA polymerase
Type:Protein
Mol. Mass.:25173.95
Organism:Hepatitis C virus
Description:Q8JXU8
Residue:229
BDBM50160861
NameBDBM50160861
Synonyms:CHEMBL414976 | Fullerene Derivative
TypeSmall organic molecule
Emp. Form.C68H28N2
Mol. Mass.872.9622
SMILESC[N+]1(C)C[C@@]23[C@@H]4[C@@H]5c6c7-c8c5c5c9c%10c%11c%12[C@H]%13[C@H]%14c%15c%16C%17=C%18[C@H]%19[C@@H]%20C(C%21=C2[C@H]2[C@H]%22c(c%21c%16%20)c%15-c%12c%22c%10c5=C42)=C2c4c%19c5c%18c%10c%12c%15c(c%13c%11c%11c%15c(c8c9%11)c8c7c(c4c6[C@]32C1)c5c%128)[C@]%101C[N+](C)(C)C[C@]%14%171