Reaction Details
TargetReverse transcriptase/RNaseH
LigandBDBM50160858
Substrate/Competitorn/a
Meas. Tech.ChEMBL_305018 (CHEMBL829452)
IC50 1700±n/a nM
Citation Mashino, TShimotohno, KIkegami, NNishikawa, DOkuda, KTakahashi, KNakamura, SMochizuki, M Human immunodeficiency virus-reverse transcriptase inhibition and hepatitis C virus RNA-dependent RNA polymerase inhibition activities of fullerene derivatives. Bioorg Med Chem Lett15:1107-9 (2005) 
 
Reverse transcriptase/RNaseH
Name:Reverse transcriptase/RNaseH
Type:PROTEIN
Mol. Mass.:65229.15
Organism:Human immunodeficiency virus 1
Description:ChEMBL_1473730
Residue:566
BDBM50160858
NameBDBM50160858
Synonyms:CHEMBL384970 | Fullerene Derivative
TypeSmall organic molecule
Emp. Form.C68H26N2
Mol. Mass.870.9463
SMILESC[N+]1(C)C[C@]23[C@H]4[C@@H]5C6=C7c8c4c4C2=C2[C@H]9[C@H]%10c4c-4c8[C@@H]8[C@@H]%11c%12c-4c%10c4c%10c9c9c2c2c%13c%14c(c5c5c6c6c%15c%16c(c%11c%11c%12c4c4c%10c%10c9c%13c9c%12c%14c5c%15c%12c5c%16c%11c4c5c%109)[C@]64C[N+](C)(C)C[C@@]784)[C@@]32C1