Reaction Details
TargetReverse transcriptase/RNaseH
LigandBDBM50160860
Substrate/Competitorn/a
Meas. Tech.ChEMBL_305018 (CHEMBL829452)
IC50 1400±n/a nM
Citation Mashino, TShimotohno, KIkegami, NNishikawa, DOkuda, KTakahashi, KNakamura, SMochizuki, M Human immunodeficiency virus-reverse transcriptase inhibition and hepatitis C virus RNA-dependent RNA polymerase inhibition activities of fullerene derivatives. Bioorg Med Chem Lett15:1107-9 (2005) 
 
Reverse transcriptase/RNaseH
Name:Reverse transcriptase/RNaseH
Type:PROTEIN
Mol. Mass.:65229.15
Organism:Human immunodeficiency virus 1
Description:ChEMBL_1473730
Residue:566
BDBM50160860
NameBDBM50160860
Synonyms:CHEMBL2373427 | Fullerene Derivative
TypeSmall organic molecule
Emp. Form.C68H26I2N2
Mol. Mass.1124.7564
SMILES[I-].[I-].[H][C@@]12C3=c4c5c6c7c8C(=C9c%10c%11c%12-c%13c%14c%15c%16c%17c%18c(c4c4c5c5c7c7c%19c8[C@]8%20C[N+](C)(C)C[C@]98[C@@]%11([H])[C@]8([H])c%13c9c%11c8c%20c%19c8c%11c%11c(c%159)c%16c9c%18c4c4c9c%11c8c7c54)[C@@]45C[N+](C)(C)C[C@@]34c(c1%10)c%12[C@]%14([H])[C@@]%175[H])[C@@]26[H]