Reaction Details
TargetThromboxane A2 receptor
LigandBDBM50160916
Substrate/Competitorn/a
Meas. Tech.ChEMBL_302705 (CHEMBL839577)
Ki 200±n/a nM
Citation Ducharme, YBlouin, MCarrière, MCChateauneuf, ACôté, BDenis, DFrenette, RGreig, GKargman, SLamontagne, SMartins, ENantel, FO'Neill, GSawyer, NMetters, KMFriesen, RW 2,3-Diarylthiophenes as selective EP1 receptor antagonists. Bioorg Med Chem Lett15:1155-60 (2005) 
 
Thromboxane A2 receptor
Name:Thromboxane A2 receptor
Type:Enyzme
Mol. Mass.:37445.28
Organism:Homo sapiens (Human)
Description:P21731
Residue:343
BDBM50160916
NameBDBM50160916
Synonyms:2-{5-[3-(2-Benzyloxy-5-chloro-phenyl)-thiophen-2-yl]-pyridin-3-yl}-1,1,1,3,3,3-hexafluoro-propan-2-ol | CHEMBL182367
TypeSmall organic molecule
Emp. Form.C25H16ClF6NO2S
Mol. Mass.543.908
SMILESOC(c1cncc(c1)-c1sccc1-c1cc(Cl)ccc1OCc1ccccc1)(C(F)(F)F)C(F)(F)F