Reaction Details
TargetThromboxane A2 receptor
LigandBDBM50160917
Substrate/Competitorn/a
Meas. Tech.ChEMBL_302705 (CHEMBL839577)
Ki 100±n/a nM
Citation Ducharme, YBlouin, MCarrière, MCChateauneuf, ACôté, BDenis, DFrenette, RGreig, GKargman, SLamontagne, SMartins, ENantel, FO'Neill, GSawyer, NMetters, KMFriesen, RW 2,3-Diarylthiophenes as selective EP1 receptor antagonists. Bioorg Med Chem Lett15:1155-60 (2005) 
 
Thromboxane A2 receptor
Name:Thromboxane A2 receptor
Type:Enyzme
Mol. Mass.:37445.28
Organism:Homo sapiens (Human)
Description:P21731
Residue:343
BDBM50160917
NameBDBM50160917
Synonyms:3-(3-(2-(benzyloxy)-5-chlorophenyl)thiophen-2-yl)benzoic acid CHEMBL362543
TypeSmall organic molecule
Emp. Form.C24H17ClO3S
Mol. Mass.420.908
SMILESOC(=O)c1cccc(c1)-c1sccc1-c1cc(Cl)ccc1OCc1ccccc1