Reaction Details
TargetThromboxane A2 receptor
LigandBDBM50160918
Substrate/Competitorn/a
Meas. Tech.ChEMBL_302705 (CHEMBL839577)
Ki>21000±n/a nM
Citation Ducharme, YBlouin, MCarrière, MCChateauneuf, ACôté, BDenis, DFrenette, RGreig, GKargman, SLamontagne, SMartins, ENantel, FO'Neill, GSawyer, NMetters, KMFriesen, RW 2,3-Diarylthiophenes as selective EP1 receptor antagonists. Bioorg Med Chem Lett15:1155-60 (2005) 
 
Thromboxane A2 receptor
Name:Thromboxane A2 receptor
Type:Enyzme
Mol. Mass.:37445.28
Organism:Homo sapiens (Human)
Description:P21731
Residue:343
BDBM50160918
NameBDBM50160918
Synonyms:CHEMBL182662 | N-{3-[3-(2-Benzyloxy-5-chloro-phenyl)-thiophen-2-yl]-phenyl}-C-phenyl-methanesulfonamide
TypeSmall organic molecule
Emp. Form.C30H24ClNO3S2
Mol. Mass.546.099
SMILESClc1ccc(OCc2ccccc2)c(c1)-c1ccsc1-c1cccc(NS(=O)(=O)Cc2ccccc2)c1