Reaction Details
TargetIntegrin alpha-L/beta-2
LigandBDBM50154496
Substrate/Competitorn/a
Meas. Tech.ChEMBL_313000 (CHEMBL873341)
IC50 26±n/a nM
Citation Potin, DLaunay, MNicolai, EFabreguette, MMalabre, PCaussade, FBesse, DSkala, SStetsko, DKTodderud, GBeno, BRCheney, DLChang, CJSheriff, SHollenbaugh, DLBarrish, JCIwanowicz, EJSuchard, SJDhar, TG De novo design, synthesis, and in vitro activity of LFA-1 antagonists based on a bicyclic[5.5]hydantoin scaffold. Bioorg Med Chem Lett15:1161-4 (2005) 
 
Integrin alpha-L/beta-2
Name:Integrin alpha-L/beta-2
Type:n/a
Mol. Mass.:n/a
Description:ASSAY_ID of EBI is 32646
Components:This complex has 2 components.
Component 1
Name:Integrin alpha-L
Synonyms:CD11 antigen-like family member A CD_antigen=CD11a ITGAL LFA-1A Leukocyte adhesion glycoprotein LFA-1 alpha chain | Leukocyte function-associated molecule 1 alpha chain
Type:PROTEIN
Mol. Mass.:128748.90
Organism:Homo sapiens (Human)
Description:ChEMBL_629045
Residue:1170
Component 2
Name:Integrin beta-2
Synonyms:CD18 ITGB2 MFI7
Type:PROTEIN
Mol. Mass.:84785.60
Organism:Homo sapiens (Human)
Description:EBI_12662
Residue:769
BDBM50154496
NameBDBM50154496
Synonyms:(R)-5-(4-Bromo-benzyl)-3-(3,5-dichloro-phenyl)-1,5-dimethyl-imidazolidine-2,4-dione CHEMBL367808
TypeSmall organic molecule
Emp. Form.C18H15BrCl2N2O2
Mol. Mass.442.134
SMILESCN1C(=O)N(C(=O)[C@@]1(C)Cc1ccc(Br)cc1)c1cc(Cl)cc(Cl)c1