Reaction Details
TargetCaspase-10
LigandBDBM50160974
Substrate/Competitorn/a
Meas. Tech.ChEMBL_306079 (CHEMBL833033)
IC50 18±n/a nM
Citation Han, YGiroux, AColucci, JBayly, CIMckay, DJRoy, SXanthoudakis, SVaillancourt, JRasper, DMTam, JTawa, PNicholson, DWZamboni, RJ Novel pyrazinone mono-amides as potent and reversible caspase-3 inhibitors. Bioorg Med Chem Lett15:1173-80 (2005) 
 
Caspase-10
Name:Caspase-10
Type:Enzyme
Mol. Mass.:58956.47
Organism:Homo sapiens (Human)
Description:Q92851
Residue:521
BDBM50160974
NameBDBM50160974
Synonyms:CHEMBL366927 | [3-(2-{5-tert-Butyl-3-[(4-methyl-furazan-3-ylmethyl)-amino]-2-oxo-2H-pyrazin-1-yl}-butyrylamino)-4-carboxy-2-oxo-butyl]-hexyl-methyl-ammonium; chloride
TypeSmall organic molecule
Emp. Form.C28H46N7O6
Mol. Mass.576.7076
SMILESCCCCCC[NH+](C)CC(=O)C(CC(O)=O)NC(=O)C(CC)n1cc(nc(NCc2nonc2C)c1=O)C(C)(C)C