Reaction Details
TargetCaspase-1
LigandBDBM50160970
Substrate/Competitorn/a
Meas. Tech.ChEMBL_305650 (CHEMBL829508)
IC50 0.025000±n/a nM
Citation Han, YGiroux, AColucci, JBayly, CIMckay, DJRoy, SXanthoudakis, SVaillancourt, JRasper, DMTam, JTawa, PNicholson, DWZamboni, RJ Novel pyrazinone mono-amides as potent and reversible caspase-3 inhibitors. Bioorg Med Chem Lett15:1173-80 (2005) 
 
Caspase-1
Name:Caspase-1
Type:Enzyme
Mol. Mass.:45154.13
Organism:Homo sapiens (Human)
Description:P29466
Residue:404
BDBM50160970
NameBDBM50160970
Synonyms:(S)-3-(2-{3-[(4-Methyl-furazan-3-ylmethyl)-amino]-2-oxo-2H-pyrazin-1-yl}-butyrylamino)-5-{[(methyl-octyl-amino)-methyl]-amino}-4-oxo-pentanoic acid | CHEMBL178514
TypeSmall organic molecule
Emp. Form.C27H44N8O6
Mol. Mass.576.6883
SMILESCCCCCCCCN(C)CNCC(=O)[C@H](CC(O)=O)NC(=O)C(CC)n1ccnc(NCc2nonc2C)c1=O