Reaction Details
TargetCaspase-3
LigandBDBM50160987
Substrate/Competitorn/a
Meas. Tech.ChEMBL_305651 (CHEMBL829509)
IC50 0.000100±n/a nM
Citation Han, YGiroux, AColucci, JBayly, CIMckay, DJRoy, SXanthoudakis, SVaillancourt, JRasper, DMTam, JTawa, PNicholson, DWZamboni, RJ Novel pyrazinone mono-amides as potent and reversible caspase-3 inhibitors. Bioorg Med Chem Lett15:1173-80 (2005) 
 
Caspase-3
Name:Caspase-3
Type:Hydrolase; heterotetramer of two heterodimers
Mol. Mass.:31607.55
Organism:Homo sapiens (Human)
Description:n/a
Residue:277
BDBM50160987
NameBDBM50160987
Synonyms:(S)-3-(2-{5-tert-Butyl-3-[(4-methyl-furazan-3-ylmethyl)-amino]-2-oxo-2H-pyrazin-1-yl}-butyrylamino)-5-{[(methyl-pentyl-amino)-methyl]-amino}-4-oxo-pentanoic acid | CHEMBL180669
TypeSmall organic molecule
Emp. Form.C28H46N8O6
Mol. Mass.590.7148
SMILESCCCCCN(C)CNCC(=O)[C@H](CC(O)=O)NC(=O)C(CC)n1cc(nc(NCc2nonc2C)c1=O)C(C)(C)C