Reaction Details
TargetCaspase-5
LigandBDBM50160957
Substrate/Competitorn/a
Meas. Tech.ChEMBL_305962 (CHEMBL832948)
IC50 0.810000±n/a nM
Citation Han, YGiroux, AColucci, JBayly, CIMckay, DJRoy, SXanthoudakis, SVaillancourt, JRasper, DMTam, JTawa, PNicholson, DWZamboni, RJ Novel pyrazinone mono-amides as potent and reversible caspase-3 inhibitors. Bioorg Med Chem Lett15:1173-80 (2005) 
 
Caspase-5
Name:Caspase-5
Type:Enzyme
Mol. Mass.:49760.80
Organism:Homo sapiens (Human)
Description:P51878
Residue:434
BDBM50160957
NameBDBM50160957
Synonyms:CHEMBL179503 | [3-(2-{5-tert-Butyl-3-[(4-methyl-furazan-3-ylmethyl)-amino]-2-oxo-2H-pyrazin-1-yl}-butyrylamino)-4-carboxy-2-oxo-butyl]-methyl-pentyl-ammonium; chloride
TypeSmall organic molecule
Emp. Form.C27H44N7O6
Mol. Mass.562.681
SMILESCCCCC[NH+](C)CC(=O)C(CC(O)=O)NC(=O)C(CC)n1cc(nc(NCc2nonc2C)c1=O)C(C)(C)C