Reaction Details
TargetCaspase-3
LigandBDBM50160954
Substrate/Competitorn/a
Meas. Tech.ChEMBL_305651 (CHEMBL829509)
IC50 0.013000±n/a nM
Citation Han, YGiroux, AColucci, JBayly, CIMckay, DJRoy, SXanthoudakis, SVaillancourt, JRasper, DMTam, JTawa, PNicholson, DWZamboni, RJ Novel pyrazinone mono-amides as potent and reversible caspase-3 inhibitors. Bioorg Med Chem Lett15:1173-80 (2005) 
 
Caspase-3
Name:Caspase-3
Type:Hydrolase; heterotetramer of two heterodimers
Mol. Mass.:31607.55
Organism:Homo sapiens (Human)
Description:n/a
Residue:277
BDBM50160954
NameBDBM50160954
Synonyms:(S)-5-[(3,4-Dihydro-1H-isoquinolin-2-ylmethyl)-amino]-3-(2-{3-[(4-methyl-furazan-3-ylmethyl)-amino]-2-oxo-2H-pyrazin-1-yl}-butyrylamino)-4-oxo-pentanoic acid | CHEMBL360788
TypeSmall organic molecule
Emp. Form.C27H34N8O6
Mol. Mass.566.6089
SMILESCCC(C(=O)N[C@@H](CC(O)=O)C(=O)CNCN1CCc2ccccc2C1)n1ccnc(NCc2nonc2C)c1=O