Reaction Details
TargetCaspase-3
LigandBDBM50160974
Substrate/Competitorn/a
Meas. Tech.ChEMBL_302945 (CHEMBL841780)
Ki 0.005000±n/a nM
Citation Han, YGiroux, AColucci, JBayly, CIMckay, DJRoy, SXanthoudakis, SVaillancourt, JRasper, DMTam, JTawa, PNicholson, DWZamboni, RJ Novel pyrazinone mono-amides as potent and reversible caspase-3 inhibitors. Bioorg Med Chem Lett15:1173-80 (2005) 
 
Caspase-3
Name:Caspase-3
Type:Hydrolase; heterotetramer of two heterodimers
Mol. Mass.:31607.55
Organism:Homo sapiens (Human)
Description:n/a
Residue:277
BDBM50160974
NameBDBM50160974
Synonyms:CHEMBL366927 | [3-(2-{5-tert-Butyl-3-[(4-methyl-furazan-3-ylmethyl)-amino]-2-oxo-2H-pyrazin-1-yl}-butyrylamino)-4-carboxy-2-oxo-butyl]-hexyl-methyl-ammonium; chloride
TypeSmall organic molecule
Emp. Form.C28H46N7O6
Mol. Mass.576.7076
SMILESCCCCCC[NH+](C)CC(=O)C(CC(O)=O)NC(=O)C(CC)n1cc(nc(NCc2nonc2C)c1=O)C(C)(C)C