Reaction Details
TargetMetabotropic glutamate receptor 5
LigandBDBM50161028
Substrate/Competitorn/a
Meas. Tech.ChEMBL_306874 (CHEMBL828680)
IC50 134±n/a nM
Citation Bonnefous, CVernier, JMHutchinson, JHChung, JReyes-Manalo, GKamenecka, T Dipyridyl amides: potent metabotropic glutamate subtype 5 (mGlu5) receptor antagonists. Bioorg Med Chem Lett15:1197-200 (2005) 
 
Metabotropic glutamate receptor 5
Name:Metabotropic glutamate receptor 5
Type:Enzyme
Mol. Mass.:132484.72
Organism:Homo sapiens (Human)
Description:n/a
Residue:1212
BDBM50161028
NameBDBM50161028
Synonyms:3-Amino-6-chloro-5-dimethylamino-pyrazine-2-carboxylic acid pyridin-2-ylamide | CHEMBL178328
TypeSmall organic molecule
Emp. Form.C12H13ClN6O
Mol. Mass.292.724
SMILESCN(C)c1nc(N)c(nc1Cl)C(=O)Nc1ccccn1