Reaction Details
TargetMetabotropic glutamate receptor 5
LigandBDBM50161030
Substrate/Competitorn/a
Meas. Tech.ChEMBL_306874 (CHEMBL828680)
IC50 23±n/a nM
Citation Bonnefous, CVernier, JMHutchinson, JHChung, JReyes-Manalo, GKamenecka, T Dipyridyl amides: potent metabotropic glutamate subtype 5 (mGlu5) receptor antagonists. Bioorg Med Chem Lett15:1197-200 (2005) 
 
Metabotropic glutamate receptor 5
Name:Metabotropic glutamate receptor 5
Type:Enzyme
Mol. Mass.:132484.72
Organism:Homo sapiens (Human)
Description:n/a
Residue:1212
BDBM50161030
NameBDBM50161030
Synonyms:3-Amino-6-chloro-5-isopropylamino-pyrazine-2-carboxylic acid pyridin-2-ylamide | CHEMBL181169
TypeSmall organic molecule
Emp. Form.C13H15ClN6O
Mol. Mass.306.751
SMILESCC(C)Nc1nc(N)c(nc1Cl)C(=O)Nc1ccccn1