Reaction Details
TargetD(3) dopamine receptor
LigandBDBM11638
Substrate/Competitorn/a
Meas. Tech.ChEMBL_302444 (CHEMBL827141)
Ki 120±n/a nM
Citation Boeckler, FLanig, HGmeiner, P Modeling the similarity and divergence of dopamine D2-like receptors and identification of validated ligand-receptor complexes. J Med Chem48:694-709 (2005) 
 
D(3) dopamine receptor
Name:D(3) dopamine receptor
Type:n/a
Mol. Mass.:44243.43
Organism:Homo sapiens (Human)
Description:n/a
Residue:400
BDBM11638
NameBDBM11638
Synonyms:CHEMBL26 N-[(1-ethylpyrrolidin-2-yl)methyl]-2-methoxy-5-sulfamoylbenzamide SULPIRIDE,(-) Sulpiride, SLP US10172837, Sulpiride
TypeSmall organic molecule
Emp. Form.C15H23N3O4S
Mol. Mass.341.426
SMILESCCN1CCCC1CNC(=O)c1cc(ccc1OC)S(N)(=O)=O