Reaction Details
TargetPhospholipase A2, membrane associated
LigandBDBM50161298
Substrate/Competitorn/a
Meas. Tech.ChEMBL_306563 (CHEMBL829138)
IC50 10±n/a nM
Citation Sawyer, JSBeight, DWSmith, ECSnyder, DWChastain, MKTielking, RLHartley, LWCarlson, DG Carbocyclic[g]indole inhibitors of human nonpancreatic s-PLA2. J Med Chem48:893-6 (2005) 
 
Phospholipase A2, membrane associated
Name:Phospholipase A2, membrane associated
Type:Hydrolase
Mol. Mass.:16101.20
Organism:Homo sapiens (Human)
Description:The human nps PLA2 was cloned, and expressed in E. coli. There was a refolding process in the purification.
Residue:144
BDBM50161298
NameBDBM50161298
Synonyms:(3-Aminooxalyl-1-benzyl-2-methyl-2,3,6,7,8,9-hexahydro-1H-benzo[g]indol-4-yloxy)-acetic acid | CHEMBL425869
TypeSmall organic molecule
Emp. Form.C24H24N2O5
Mol. Mass.420.4578
SMILESCc1c(C(=O)C(N)=O)c2c(OCC(O)=O)cc3CCCCc3c2n1Cc1ccccc1