Reaction Details
TargetPhospholipase A2, membrane associated
LigandBDBM50161305
Substrate/Competitorn/a
Meas. Tech.ChEMBL_306563 (CHEMBL829138)
IC50 11±n/a nM
Citation Sawyer, JSBeight, DWSmith, ECSnyder, DWChastain, MKTielking, RLHartley, LWCarlson, DG Carbocyclic[g]indole inhibitors of human nonpancreatic s-PLA2. J Med Chem48:893-6 (2005) 
 
Phospholipase A2, membrane associated
Name:Phospholipase A2, membrane associated
Type:Hydrolase
Mol. Mass.:16101.20
Organism:Homo sapiens (Human)
Description:The human nps PLA2 was cloned, and expressed in E. coli. There was a refolding process in the purification.
Residue:144
BDBM50161305
NameBDBM50161305
Synonyms:(3-Aminooxalyl-1-cyclohexylmethyl-2-methyl-2,3-dihydro-1H-benzo[g]indol-4-yloxy)-acetic acid | CHEMBL425696
TypeSmall organic molecule
Emp. Form.C24H26N2O5
Mol. Mass.422.4736
SMILESCc1c(C(=O)C(N)=O)c2c(OCC(O)=O)cc3ccccc3c2n1CC1CCCCC1