Reaction Details
TargetSerine/threonine-protein kinase 38-like
LigandBDBM50024294
Substrate/Competitorn/a
Meas. Tech.ChEMBL_325118 (CHEMBL861050)
Kd 2300±n/a nM
Citation Fabian, MABiggs, WHTreiber, DKAtteridge, CEAzimioara, MDBenedetti, MGCarter, TACiceri, PEdeen, PTFloyd, MFord, JMGalvin, MGerlach, JLGrotzfeld, RMHerrgard, SInsko, DEInsko, MALai, AGLélias, JMMehta, SAMilanov, ZVVelasco, AMWodicka, LMPatel, HKZarrinkar, PPLockhart, DJ A small molecule-kinase interaction map for clinical kinase inhibitors. Nat Biotechnol23:329-36 (2005) 
 
Serine/threonine-protein kinase 38-like
Name:Serine/threonine-protein kinase 38-like
Type:PROTEIN
Mol. Mass.:54004.24
Organism:Homo sapiens (Human)
Description:ChEMBL_587191
Residue:464
BDBM50024294
NameBDBM50024294
Synonyms:SP-600125
TypeSmall organic molecule
Emp. Form.C14H8N2O
Mol. Mass.220.2261
SMILESOc1c2cccc3N=Nc(c23)c2ccccc12