Reaction Details
TargetDeath-associated protein kinase 2
LigandBDBM50024294
Substrate/Competitorn/a
Meas. Tech.ChEMBL_325092 (CHEMBL860909)
Kd 610±n/a nM
Citation Fabian, MABiggs, WHTreiber, DKAtteridge, CEAzimioara, MDBenedetti, MGCarter, TACiceri, PEdeen, PTFloyd, MFord, JMGalvin, MGerlach, JLGrotzfeld, RMHerrgard, SInsko, DEInsko, MALai, AGLélias, JMMehta, SAMilanov, ZVVelasco, AMWodicka, LMPatel, HKZarrinkar, PPLockhart, DJ A small molecule-kinase interaction map for clinical kinase inhibitors. Nat Biotechnol23:329-36 (2005) 
 
Death-associated protein kinase 2
Name:Death-associated protein kinase 2
Type:PROTEIN
Mol. Mass.:42900.09
Organism:Homo sapiens (Human)
Description:ChEMBL_774557
Residue:370
BDBM50024294
NameBDBM50024294
Synonyms:SP-600125
TypeSmall organic molecule
Emp. Form.C14H8N2O
Mol. Mass.220.2261
SMILESOc1c2cccc3N=Nc(c23)c2ccccc12