Reaction Details
TargetSerine/threonine-protein kinase MARK2
LigandBDBM50024294
Substrate/Competitorn/a
Meas. Tech.ChEMBL_325049 (CHEMBL860785)
Kd 1800±n/a nM
Citation Fabian, MABiggs, WHTreiber, DKAtteridge, CEAzimioara, MDBenedetti, MGCarter, TACiceri, PEdeen, PTFloyd, MFord, JMGalvin, MGerlach, JLGrotzfeld, RMHerrgard, SInsko, DEInsko, MALai, AGLélias, JMMehta, SAMilanov, ZVVelasco, AMWodicka, LMPatel, HKZarrinkar, PPLockhart, DJ A small molecule-kinase interaction map for clinical kinase inhibitors. Nat Biotechnol23:329-36 (2005) 
 
Serine/threonine-protein kinase MARK2
Name:Serine/threonine-protein kinase MARK2
Type:PROTEIN
Mol. Mass.:87953.09
Organism:Homo sapiens (Human)
Description:ChEMBL_774586
Residue:788
BDBM50024294
NameBDBM50024294
Synonyms:SP-600125
TypeSmall organic molecule
Emp. Form.C14H8N2O
Mol. Mass.220.2261
SMILESOc1c2cccc3N=Nc(c23)c2ccccc12