Reaction Details
TargetSerine/threonine-protein kinase ULK3
LigandBDBM4814
Substrate/Competitorn/a
Meas. Tech.ChEMBL_325004 (CHEMBL860640)
Kd 110±n/a nM
Citation Fabian, MABiggs, WHTreiber, DKAtteridge, CEAzimioara, MDBenedetti, MGCarter, TACiceri, PEdeen, PTFloyd, MFord, JMGalvin, MGerlach, JLGrotzfeld, RMHerrgard, SInsko, DEInsko, MALai, AGLélias, JMMehta, SAMilanov, ZVVelasco, AMWodicka, LMPatel, HKZarrinkar, PPLockhart, DJ A small molecule-kinase interaction map for clinical kinase inhibitors. Nat Biotechnol23:329-36 (2005) 
 
Serine/threonine-protein kinase ULK3
Name:Serine/threonine-protein kinase ULK3
Type:PROTEIN
Mol. Mass.:53575.05
Organism:Mus musculus
Description:ChEMBL_325004
Residue:472
BDBM4814
NameBDBM4814
Synonyms:CHEMBL535 N-[2-(diethylamino)ethyl]-5-{[(3Z)-5-fluoro-2-oxo-2,3-dihydro-1H-indol-3-ylidene]methyl}-2,4-dimethyl-1H-pyrrole-3-carboxamide SUNITINIB US10464902, Sunitinib US9914707, SU11248
TypeSmall organic molecule
Emp. Form.C22H27FN4O2
Mol. Mass.398.4738
SMILESCCN(CC)CCNC(=O)c1c(C)[nH]c(\C=C2/C(=O)Nc3ccc(F)cc23)c1C